BDBM50206470 CHEMBL3930972
SMILES Cc1ccc(\C=C2/S\C(=N/c3ccccc3)N(Cc3ccco3)C2=O)cc1
InChI Key InChIKey=JXYDHORIMCUIDI-DJOYVXLESA-N
Data  1 KI
  Tab Delimited (TSV)   2D SDfile   Computed 3D by Vconf -m prep SDfile
Find this compound or compounds like it in BindingDB:
Activity Spreadsheet -- Enzyme Inhibition Constant Data from BindingDB
Found 1 hit for monomerid = 50206470
TargetThioredoxin reductase(Entamoeba histolytica)
Jamia Millia Islamia
Curated by ChEMBL
LigandPNGBDBM50206470(CHEMBL3930972)
Affinity DataKi:  2.82E+3nM. Assay description: Inhibition of Entamoeba histolytica thioredoxin reductase
In DepthDetails ArticlePubMed