BDBM50206543 2-benzyl-N-hydroxy-N'-naphthalen-1-ylmethyl-malonamide::CHEMBL219612
SMILES ONC(=O)C(Cc1ccccc1)C(=O)NCc1cccc2ccccc12
InChI Key InChIKey=AYAUNYIVFRMOEV-UHFFFAOYSA-N
Data  1 IC50
  Tab Delimited (TSV)   2D SDfile   Computed 3D by Vconf -m prep SDfile
Find this compound or compounds like it in BindingDB:
Activity Spreadsheet -- Enzyme Inhibition Constant Data from BindingDB
Found 1 hit for monomerid = 50206543
TargetM1 family aminopeptidase(Plasmodium falciparum (isolate FcB1 / Columbia))
University Of Lille
Curated by ChEMBL
LigandPNGBDBM50206543(2-benzyl-N-hydroxy-N'-naphthalen-1-ylmethyl-malona...)
Affinity DataIC50:  107nM. Assay description: Inhibition of Plasmodium falciparum FcB1 M1 aminopeptidase
In DepthDetails ArticlePubMed