BDBM50206691 (S)-3-[6-(4-chloro-phenyl)-4-oxo-4H-thieno[3,2-d]pyrimidin-3-yl]-pyrrolidine-1-carboxylic acid methyl-{(S)-1-[2-oxo-2-(4-trifluoromethoxy-phenyl)-ethyl]-pyrrolidin-3-yl}-amide::CHEMBL445407
SMILES CN([C@H]1CCN(CC(=O)c2ccc(OC(F)(F)F)cc2)C1)C(=O)N1CC[C@@H](C1)n1cnc2cc(sc2c1=O)-c1ccc(Cl)cc1
InChI Key InChIKey=DKBGEPSCCNDNAW-GOTSBHOMSA-N
Data  1 KI
  Tab Delimited (TSV)   2D SDfile   Computed 3D by Vconf -m prep SDfile
Find this compound or compounds like it in BindingDB:
Activity Spreadsheet -- Enzyme Inhibition Constant Data from BindingDB
Found 1 hit for monomerid = 50206691
TargetMelanin-concentrating hormone receptor 1(Homo sapiens (Human))
Neurocrine Biosciences
Curated by ChEMBL
LigandPNGBDBM50206691((S)-3-[6-(4-chloro-phenyl)-4-oxo-4H-thieno[3,2-d]p...)
Affinity DataKi:  80nM. Assay description: Binding affinity to human MCHR1
In DepthDetails ArticlePubMed