BDBM50206747 CHEMBL3891704
SMILES C(C1CCC1)c1cccc2N3CCCNCC3CCc12
InChI Key InChIKey=HAPNHNITJZXTMP-UHFFFAOYSA-N
Data  2 EC50
  Tab Delimited (TSV)   2D SDfile   Computed 3D by Vconf -m prep SDfile
Find this compound or compounds like it in BindingDB:
Activity Spreadsheet -- Enzyme Inhibition Constant Data from BindingDB
Found 2 hits for monomerid = 50206747
Target5-hydroxytryptamine receptor 2C(Homo sapiens (Human))
Arena Pharmaceuticals
Curated by ChEMBL
LigandPNGBDBM50206747(CHEMBL3891704)
Affinity DataEC50:  126nM. Assay description: Displacement of [125I]DOI from recombinant human 5-HT2C receptor expressed in HEK293 cell membranes after 1 hr by scintillation counting
In DepthDetails ArticlePubMed
Target5-hydroxytryptamine receptor 2B(Homo sapiens (Human))
Arena Pharmaceuticals
Curated by ChEMBL
LigandPNGBDBM50206747(CHEMBL3891704)
Affinity DataEC50: <1.00E+3nM. Assay description: Agonist activity at 5-HT2B receptor (unknown origin) expressed in HEK293 cells assessed as [3H]inositol phosphate accumulation after 2 hrs by scintil...
In DepthDetails ArticlePubMed