BDBM50206824 (R)-3-amino-1-(2-benzoylpyrazolidin-1-yl)-4-(2,4,5-trifluorophenyl)butan-1-one hydrochloride::CHEMBL539610
SMILES N[C@@H](CC(=O)N1CCCN1C(=O)c1ccccc1)Cc1cc(F)c(F)cc1F
InChI Key InChIKey=SLAUFSBANJZJRJ-OAHLLOKOSA-N
Data  1 IC50
  Tab Delimited (TSV)   2D SDfile   Computed 3D by Vconf -m prep SDfile
Find this compound or compounds like it in BindingDB:
Activity Spreadsheet -- Enzyme Inhibition Constant Data from BindingDB
Found 1 hit for monomerid = 50206824
TargetDipeptidyl peptidase 4(Homo sapiens (Human))
Korea Research Institute Of Chemical Technology
Curated by ChEMBL
LigandPNGBDBM50206824((R)-3-amino-1-(2-benzoylpyrazolidin-1-yl)-4-(2,4,5...)
Affinity DataIC50:  350nM. Assay description: Inhibition of DPP4
In DepthDetails ArticlePubMed