BDBM50206873 CHEMBL3952086
SMILES COCCN(CC1CCN(CC#C)CC1)C(=O)c1ccc2ccccc2c1
InChI Key InChIKey=XRHQVRLQJJVPLD-UHFFFAOYSA-N
Data  4 IC50
  Tab Delimited (TSV)   2D SDfile   Computed 3D by Vconf -m prep SDfile
Find this compound or compounds like it in BindingDB:
Activity Spreadsheet -- Enzyme Inhibition Constant Data from BindingDB
Found 4 hits for monomerid = 50206873
TargetCholinesterase(Homo sapiens (Human))
University Of Ljubljana
Curated by ChEMBL
LigandPNGBDBM50206873(CHEMBL3952086)
Affinity DataIC50:  4.04E+3nM. Assay description: Inhibition of human recombinant BuChe using butyrylthiocholine as substrate preincubated for 5 mins followed by substrate addition measured for 1 min...
In DepthDetails ArticlePubMed
TargetAmine oxidase [flavin-containing] A(Homo sapiens (Human))
University Of Ljubljana
Curated by ChEMBL
LigandPNGBDBM50206873(CHEMBL3952086)
Affinity DataIC50: >1.00E+5nM. Assay description: Inhibition of human recombinant microsomal MAO-A expressed in baculovirus-infected insect cells using p-tyramine as substrate preincubated for 15 min...
In DepthDetails ArticlePubMed
TargetAmine oxidase [flavin-containing] B(Homo sapiens (Human))
University Of Ljubljana
Curated by ChEMBL
LigandPNGBDBM50206873(CHEMBL3952086)
Affinity DataIC50: >1.00E+5nM. Assay description: Inhibition of human recombinant microsomal MAO-B expressed in baculovirus-infected insect cells using p-tyramine as substrate preincubated for 15 min...
In DepthDetails ArticlePubMed
TargetAcetylcholinesterase(Mus musculus (mouse))
University Of Ljubljana
Curated by ChEMBL
LigandPNGBDBM50206873(CHEMBL3952086)
Affinity DataIC50: >1.00E+5nM. Assay description: Inhibition of mouse AChe using acetylthiocholine as substrate preincubated for 5 mins followed by substrate addition measured for 1 min by Ellman's m...
In DepthDetails ArticlePubMed