BDBM50207092 CHEMBL3891773
SMILES N[C@H]1CC[C@H](CCN2CCN(CC2)c2nsc3ccccc23)CC1
InChI Key InChIKey=HMETZCGOVJHJBJ-WKILWMFISA-N
Data  4 KI
  Tab Delimited (TSV)   2D SDfile   Computed 3D by Vconf -m prep SDfile
Find this compound or compounds like it in BindingDB:
Activity Spreadsheet -- Enzyme Inhibition Constant Data from BindingDB
Found 4 hits for monomerid = 50207092
Target5-hydroxytryptamine receptor 2A(Homo sapiens (Human))
Shanghai Jiao Tong University
Curated by ChEMBL
LigandPNGBDBM50207092(CHEMBL3891773)
Affinity DataKi:  0.210nM. Assay description: Displacement of [3H]ketanserin from recombinant human 5-HT2A receptor expressed in HEK293 cell membranes after 60 mins by scintillation counting meth...
In DepthDetails ArticlePubMed
TargetD(2) dopamine receptor(Homo sapiens (Human))
Shanghai Jiao Tong University
Curated by ChEMBL
LigandPNGBDBM50207092(CHEMBL3891773)
Affinity DataKi:  4.60nM. Assay description: Displacement of [3H]spiperone from recombinant human D2L receptor expressed in CHO cell membranes after 60 mins by scintillation counting method
In DepthDetails ArticlePubMed
Target5-hydroxytryptamine receptor 1A(Homo sapiens (Human))
Shanghai Jiao Tong University
Curated by ChEMBL
LigandPNGBDBM50207092(CHEMBL3891773)
Affinity DataKi:  7.20nM. Assay description: Displacement of [3H]8-OH-DPAT from recombinant human 5-HT1A receptor expressed in HEK293 cell membranes after 60 mins by scintillation counting metho...
In DepthDetails ArticlePubMed
TargetD(3) dopamine receptor(Homo sapiens (Human))
Shanghai Jiao Tong University
Curated by ChEMBL
LigandPNGBDBM50207092(CHEMBL3891773)
Affinity DataKi:  9.60nM. Assay description: Displacement of [3H]methyl-spiperone from recombinant human D3 receptor expressed in CHO cell membranes after 60 mins by scintillation counting metho...
In DepthDetails ArticlePubMed