BDBM50207186 CHEMBL3967405
SMILES CN(C)CCOc1ccc(cc1)-c1ccnc(Nc2ccc(cc2)S(N)(=O)=O)n1
InChI Key InChIKey=XUHKAYYHRKVAST-UHFFFAOYSA-N
Data  1 IC50
  Tab Delimited (TSV)   2D SDfile   Computed 3D by Vconf -m prep SDfile
Find this compound or compounds like it in BindingDB:
Activity Spreadsheet -- Enzyme Inhibition Constant Data from BindingDB
Found 1 hit for monomerid = 50207186
TargetInhibitor of nuclear factor kappa-B kinase subunit beta(Homo sapiens (Human))
Korea Advanced Institute Of Science And Technology (Kaist)
Curated by ChEMBL
LigandPNGBDBM50207186(CHEMBL3967405)
Affinity DataIC50:  7.90E+4nM. Assay description: Inhibition of IKKbeta (unknown origin)
In DepthDetails ArticlePubMed