BDBM50207326 CHEMBL3891935
SMILES Fc1cccc(Cl)c1Nc1nc2cc(C(=O)Nc3cccc(c3)C(F)(F)F)c3ncccc3c2[nH]1
InChI Key InChIKey=NIHHRYQEPRIIBI-UHFFFAOYSA-N
Data  2 IC50
  Tab Delimited (TSV)   2D SDfile   Computed 3D by Vconf -m prep SDfile
Find this compound or compounds like it in BindingDB:
Activity Spreadsheet -- Enzyme Inhibition Constant Data from BindingDB
Found 2 hits for monomerid = 50207326
TargetProstaglandin E synthase(Homo sapiens (Human))
Glenmark Pharmaceuticals
Curated by ChEMBL
LigandPNGBDBM50207326(CHEMBL3891935)
Affinity DataIC50:  16nM. Assay description: Inhibition of human recombinant mPGES-1 expressed in CHO cells assessed as reduction in conversion of PGH2 to PGE2 incubated for 10 mins followed by ...
In DepthDetails ArticlePubMed
TargetProstaglandin E synthase(Homo sapiens (Human))
Glenmark Pharmaceuticals
Curated by ChEMBL
LigandPNGBDBM50207326(CHEMBL3891935)
Affinity DataIC50:  43nM. Assay description: Inhibition of mPGES-1 in human A549 cells assessed as reduction in interleukin-1 beta-induced PGE2 production incubated for 30 mins followed by IL-1b...
In DepthDetails ArticlePubMed