BDBM50207452 CHEMBL3983738
SMILES COc1ccccc1CN(C)Cc1ccc(\C=C2/COc3cc(OC)c(OC)cc3C2=O)cc1O
InChI Key InChIKey=GEJZASRNVWWCPY-SRZZPIQSSA-N
Data  2 IC50
  Tab Delimited (TSV)   2D SDfile   Computed 3D by Vconf -m prep SDfile
Find this compound or compounds like it in BindingDB:
Activity Spreadsheet -- Enzyme Inhibition Constant Data from BindingDB
Found 2 hits for monomerid = 50207452
TargetAcetylcholinesterase(Electrophorus electricus (Electric eel))
Sichuan University
Curated by ChEMBL
LigandPNGBDBM50207452(CHEMBL3983738)
Affinity DataIC50:  1.64E+4nM. Assay description: Inhibition of Electrophorus electricus AChE using acetylthiocholine iodide as substrate measured after 15 mins by Ellman's method
In DepthDetails ArticlePubMed
TargetAmine oxidase [flavin-containing] B(Homo sapiens (Human))
Sichuan University
Curated by ChEMBL
LigandPNGBDBM50207452(CHEMBL3983738)
Affinity DataIC50:  1.03E+3nM. Assay description: Inhibition of human recombinant MAO-B using kynuramine as substrate measured after 30 mins by fluorescence assay
In DepthDetails ArticlePubMed