BDBM50207525 CHEMBL3896591
SMILES Cc1nnc2sc(C(=O)NCc3ccc(c(F)c3)S(C)(=O)=O)c(N)c2c1C
InChI Key InChIKey=LGEGCVPUCXJWNX-UHFFFAOYSA-N
Data  2 EC50
  Tab Delimited (TSV)   2D SDfile   Computed 3D by Vconf -m prep SDfile
Find this compound or compounds like it in BindingDB:
Activity Spreadsheet -- Enzyme Inhibition Constant Data from BindingDB
Found 2 hits for monomerid = 50207525
TargetMuscarinic acetylcholine receptor M4(RAT)
Vanderbilt University Medical Center
Curated by ChEMBL
LigandPNGBDBM50207525(CHEMBL3896591)
Affinity DataEC50:  58nM. Assay description: Positive allosteric modulation of rat M4 receptor expressed in CHO cells co-expressing Gqui5 by calcium mobilization assay
In DepthDetails ArticlePubMed
TargetMuscarinic acetylcholine receptor M4(RAT)
Vanderbilt University Medical Center
Curated by ChEMBL
LigandPNGBDBM50207525(CHEMBL3896591)
Affinity DataEC50:  58nM. Assay description: Positive allosteric modulation of rat M4 receptor expressed in CHO cells co-expressing Gqui5 by calcium mobilization assay
In DepthDetails ArticlePubMed