BDBM50207694 CHEMBL3925106
SMILES CC(C(=O)COc1ccc(cc1)-c1ccccc1)n1ncnn1
InChI Key InChIKey=DHKXCVYJESXMOC-UHFFFAOYSA-N
Data  1 IC50
  Tab Delimited (TSV)   2D SDfile   Computed 3D by Vconf -m prep SDfile
Find this compound or compounds like it in BindingDB:
Activity Spreadsheet -- Enzyme Inhibition Constant Data from BindingDB
Found 1 hit for monomerid = 50207694
TargetFatty-acid amide hydrolase 1 [30-579](Rattus norvegicus (rat))
University Of M£Nster
Curated by ChEMBL
LigandPNGBDBM50207694(CHEMBL3925106)
Affinity DataIC50:  6.30E+3nM. Assay description: Inhibition of FAAH in rat brain microsomes using N-(2-hydroxyethyl)-4-pyren-1-ylbutanamide as substrate after 60 mins by fluorescence-based reversed ...
In DepthDetails ArticlePubMed