BDBM50207853 3-isopropyl-N-(3-(3-(4-(methylamino)-1,3,5-triazin-2-yl)pyridin-2-yloxy)phenyl)benzamide::CHEMBL245948
SMILES CNc1ncnc(n1)-c1cccnc1Oc1cccc(NC(=O)c2cccc(c2)C(C)C)c1
InChI Key InChIKey=ROJPTCGXRHNIRD-UHFFFAOYSA-N
Data  3 IC50
  Tab Delimited (TSV)   2D SDfile   Computed 3D by Vconf -m prep SDfile
Find this compound or compounds like it in BindingDB:
Activity Spreadsheet -- Enzyme Inhibition Constant Data from BindingDB
Found 3 hits for monomerid = 50207853
TargetVascular endothelial growth factor receptor 2(Homo sapiens (Human))
Amgen
Curated by ChEMBL
LigandPNGBDBM50207853(3-isopropyl-N-(3-(3-(4-(methylamino)-1,3,5-triazin...)
Affinity DataIC50:  456nM. Assay description: Inhibition of KDR after 90 mins by HTRF assay
In DepthDetails ArticlePubMed
TargetAngiopoietin-1 receptor(Homo sapiens (Human))
Amgen
Curated by ChEMBL
LigandPNGBDBM50207853(3-isopropyl-N-(3-(3-(4-(methylamino)-1,3,5-triazin...)
Affinity DataIC50:  6nM. Assay description: Inhibition of Tie2 after 90 mins by HTRF assay
In DepthDetails ArticlePubMed
TargetAngiopoietin-1 receptor(Homo sapiens (Human))
Amgen
Curated by ChEMBL
LigandPNGBDBM50207853(3-isopropyl-N-(3-(3-(4-(methylamino)-1,3,5-triazin...)
Affinity DataIC50:  85nM. Assay description: Inhibition of Tie2 autophosphorylation in EA.hy926 cells after 2.5 hrs
In DepthDetails ArticlePubMed