BDBM50208014 3-(1-benzyl-tropin-4-yl)-5,5-diphenyl-imidazolidin-2-one::CHEMBL221400
SMILES O=C1NC(CN1C1CC2CCC(C1)N2Cc1ccccc1)(c1ccccc1)c1ccccc1
InChI Key InChIKey=ZDNLCBVEWCZBLZ-UHFFFAOYSA-N
Data  2 KI
  Tab Delimited (TSV)   2D SDfile   Computed 3D by Vconf -m prep SDfile
Find this compound or compounds like it in BindingDB:
Activity Spreadsheet -- Enzyme Inhibition Constant Data from BindingDB
Found 2 hits for monomerid = 50208014
TargetMuscarinic acetylcholine receptor M3(Homo sapiens (Human))
Via Zambeletti 25
Curated by ChEMBL
LigandPNGBDBM50208014(3-(1-benzyl-tropin-4-yl)-5,5-diphenyl-imidazolidin...)
Affinity DataKi:  4.10nM. Assay description: Displacement of [3H]N-methyl-scopalamine from human muscarinic M3 receptor expressed in CHO K1 cells
In DepthDetails ArticlePubMed
TargetMuscarinic acetylcholine receptor M2(Homo sapiens (Human))
Via Zambeletti 25
Curated by ChEMBL
LigandPNGBDBM50208014(3-(1-benzyl-tropin-4-yl)-5,5-diphenyl-imidazolidin...)
Affinity DataKi:  65nM. Assay description: Displacement of [3H]N-methyl-scopalamine from human muscarinic M2 receptor expressed in CHO K1 cells
In DepthDetails ArticlePubMed