BDBM50208105 (S)-2-((S)-1-(3-((1H-imidazol-1-yl)methyl)benzoyl)pyrrolidine-2-carboxamido)-3-phenylpropanoic acid::CHEMBL374751
SMILES OC(=O)[C@H](Cc1ccccc1)NC(=O)[C@@H]1CCCN1C(=O)c1cccc(Cn2ccnc2)c1
InChI Key InChIKey=IFUZFWPUVIVQDR-VXKWHMMOSA-N
Data  1 KI
  Tab Delimited (TSV)   2D SDfile   Computed 3D by Vconf -m prep SDfile
Find this compound or compounds like it in BindingDB:
Activity Spreadsheet -- Enzyme Inhibition Constant Data from BindingDB
Found 1 hit for monomerid = 50208105
TargetType-2 angiotensin II receptor(Homo sapiens (Human))
Uppsala University
Curated by ChEMBL
LigandPNGBDBM50208105((S)-2-((S)-1-(3-((1H-imidazol-1-yl)methyl)benzoyl)...)
Affinity DataKi: >1.00E+4nM. Assay description: Displacement of [125I]Ang2 from AT2 receptor in pig uterus myometrial membrane
In DepthDetails ArticlePubMed