BDBM50208226 (E)-1-(5-chlorobenzo[b]thiophen-3-yl)-2-oxo-2-(styrylamino)ethylphosphonic acid::CHEMBL223303
SMILES OP(O)(=O)C(C(=O)NC=Cc1ccccc1)c1csc2ccc(Cl)cc12
InChI Key InChIKey=MNUNMFWGEVHZSR-UHFFFAOYSA-N
Data  1 IC50
  Tab Delimited (TSV)   2D SDfile   Computed 3D by Vconf -m prep SDfile
Find this compound or compounds like it in BindingDB:
Activity Spreadsheet -- Enzyme Inhibition Constant Data from BindingDB
Found 1 hit for monomerid = 50208226
TargetChymase(Homo sapiens (Human))
Johnson & Johnson Pharmaceutical Research And Development
Curated by ChEMBL
LigandPNGBDBM50208226((E)-1-(5-chlorobenzo[b]thiophen-3-yl)-2-oxo-2-(sty...)
Affinity DataIC50:  60nM. Assay description: Inhibition of human skin chymase
In DepthDetails ArticlePubMed