BDBM50208307 CHEMBL3883584
SMILES Fc1ccc(-[#6](=O)-[#7]\[#7]=[#6]-2\[#6]-[#6](-[#7]-[#6](-[#6]-2)-c2ccccc2)-c2ccccc2)c(c1)C(F)(F)F
InChI Key InChIKey=WBLAAOYAEKZCRC-UHFFFAOYSA-N
Data  2 IC50
  Tab Delimited (TSV)   2D SDfile   Computed 3D by Vconf -m prep SDfile
Find this compound or compounds like it in BindingDB:
Activity Spreadsheet -- Enzyme Inhibition Constant Data from BindingDB
Found 2 hits for monomerid = 50208307
TargetCholinesterase(Equus caballus (Horse))
Gaziantep University
Curated by ChEMBL
LigandPNGBDBM50208307(CHEMBL3883584)
Affinity DataIC50:  5.24E+4nM. Assay description: Inhibition of horse serum butyrylcholinesterase by Ellman's method
In DepthDetails ArticlePubMed
TargetAcetylcholinesterase(Electrophorus electricus (Electric eel))
Gaziantep University
Curated by ChEMBL
LigandPNGBDBM50208307(CHEMBL3883584)
Affinity DataIC50:  4.95E+4nM. Assay description: Inhibition of electric eel acetylcholinesterase using acetylthiocholine iodide as substrate by Ellman's method
In DepthDetails ArticlePubMed