BDBM50208605 CHEMBL3885022
SMILES [O-][N+](=O)c1ccc(cc1)C(=O)Nc1ccccc1-c1nnn(n1)-c1ccccc1
InChI Key InChIKey=ZUFMOBQFIVTIRF-UHFFFAOYSA-N
Data  2 IC50
  Tab Delimited (TSV)   2D SDfile   Computed 3D by Vconf -m prep SDfile
Find this compound or compounds like it in BindingDB:
Activity Spreadsheet -- Enzyme Inhibition Constant Data from BindingDB
Found 2 hits for monomerid = 50208605
TargetBroad substrate specificity ATP-binding cassette transporter ABCG2(Homo sapiens (Human))
Rheinische Friedrich-Wilhelms-Universit£T Bonn
Curated by ChEMBL
LigandPNGBDBM50208605(CHEMBL3885022)
Affinity DataIC50:  150nM. Assay description: Inhibition of recombinant human GFP-fused ABCG2 expressed in MDCK2 cells assessed as reduction in Hoechst 33342 efflux preincubated for 30 mins follo...
In DepthDetails ArticlePubMed
TargetBroad substrate specificity ATP-binding cassette transporter ABCG2(Homo sapiens (Human))
Rheinische Friedrich-Wilhelms-Universit£T Bonn
Curated by ChEMBL
LigandPNGBDBM50208605(CHEMBL3885022)
Affinity DataIC50:  321nM. Assay description: Inhibition of recombinant human GFP-fused ABCG2 expressed in MDCK2 cells assessed as reduction in pheophorbide A efflux preincubated for 30 mins foll...
In DepthDetails ArticlePubMed