BDBM50208623 CHEMBL3883221
SMILES CCOc1ccc(cc1)-n1nnc(n1)-c1ccccc1NC(=O)c1ccccc1[N+]([O-])=O
InChI Key InChIKey=SQEIFOFNHSSNEE-UHFFFAOYSA-N
Data  1 IC50
  Tab Delimited (TSV)   2D SDfile   Computed 3D by Vconf -m prep SDfile
Find this compound or compounds like it in BindingDB:
Activity Spreadsheet -- Enzyme Inhibition Constant Data from BindingDB
Found 1 hit for monomerid = 50208623
TargetBroad substrate specificity ATP-binding cassette transporter ABCG2(Homo sapiens (Human))
Rheinische Friedrich-Wilhelms-Universit£T Bonn
Curated by ChEMBL
LigandPNGBDBM50208623(CHEMBL3883221)
Affinity DataIC50:  308nM. Assay description: Inhibition of recombinant human GFP-fused ABCG2 expressed in MDCK2 cells assessed as reduction in Hoechst 33342 efflux preincubated for 30 mins follo...
In DepthDetails ArticlePubMed