BDBM50208851 (R)-N-(4-cyano-1-methylpiperidin-4-yl)-2-(cyclohexylmethyl)-4-morpholino-4-oxobutanamide::CHEMBL232910
SMILES CN1CCC(CC1)(NC(=O)[C@H](CC1CCCCC1)CC(=O)N1CCOCC1)C#N
InChI Key InChIKey=XXUDZJPOISUMDL-LJQANCHMSA-N
Data  1 IC50  1 Kd
  Tab Delimited (TSV)   2D SDfile   Computed 3D by Vconf -m prep SDfile
Find this compound or compounds like it in BindingDB:
Activity Spreadsheet -- Enzyme Inhibition Constant Data from BindingDB
Found 2 hits for monomerid = 50208851
TargetCathepsin S(Homo sapiens (Human))
Boehringer Ingelheim Pharmaceuticals
Curated by ChEMBL
LigandPNGBDBM50208851((R)-N-(4-cyano-1-methylpiperidin-4-yl)-2-(cyclohex...)
Affinity DataKd:  177nM. Assay description: Inhibition of human cathepsin S
In DepthDetails ArticlePubMed
TargetCathepsin S(Homo sapiens (Human))
Boehringer Ingelheim Pharmaceuticals
Curated by ChEMBL
LigandPNGBDBM50208851((R)-N-(4-cyano-1-methylpiperidin-4-yl)-2-(cyclohex...)
Affinity DataIC50:  251nM. Assay description: Inhibition of human cathepsin S
In DepthDetails ArticlePubMed