BDBM50209090 4-hydroxybenzaldehyde (4-methoxyphenyl)hydrazone::CHEMBL224086
SMILES COc1ccc(cc1)N=NCc1ccc(O)cc1
InChI Key InChIKey=GIKWPJYNHPZUTF-UHFFFAOYSA-N
Data  1 IC50
  Tab Delimited (TSV)   2D SDfile   Computed 3D by Vconf -m prep SDfile
Find this compound or compounds like it in BindingDB:
Activity Spreadsheet -- Enzyme Inhibition Constant Data from BindingDB
Found 1 hit for monomerid = 50209090
TargetMacrophage migration inhibitory factor(Homo sapiens (Human))
The New York School Of Medicine
Curated by ChEMBL
LigandPNGBDBM50209090(4-hydroxybenzaldehyde (4-methoxyphenyl)hydrazone |...)
Affinity DataIC50:  480nM. Assay description: Inhibition of MIF tautomerase activity by spectrophotometric assay
In DepthDetails ArticlePubMed