BDBM50209170 4-(5-chloro-1H-indol-3-yl)-N,N-dimethylcyclohex-3-enamine::CHEMBL234928
SMILES CN(C)C1CCC(=CC1)c1c[nH]c2ccc(Cl)cc12
InChI Key InChIKey=GFNMZMSNUJYADM-UHFFFAOYSA-N
Data  1 IC50
  Tab Delimited (TSV)   2D SDfile   Computed 3D by Vconf -m prep SDfile
Find this compound or compounds like it in BindingDB:
Activity Spreadsheet -- Enzyme Inhibition Constant Data from BindingDB
Found 1 hit for monomerid = 50209170
TargetSodium-dependent serotonin transporter(Homo sapiens (Human))
Bristol-Myers Squibb Pharmaceutical Research Institute
Curated by ChEMBL
LigandPNGBDBM50209170(4-(5-chloro-1H-indol-3-yl)-N,N-dimethylcyclohex-3-...)
Affinity DataIC50:  19nM. Assay description: Displacement of [3H]citalopram from human SERT expressed in HEK293 cells
In DepthDetails ArticlePubMed