BDBM50209171 4-(5-bromo-1H-indol-3-yl)-N,N-dimethylcyclohex-3-enamine::CHEMBL396540
SMILES CN(C)C1CCC(=CC1)c1c[nH]c2ccc(Br)cc12
InChI Key InChIKey=ITHSRMGXDMLBTP-UHFFFAOYSA-N
Data  1 IC50
  Tab Delimited (TSV)   2D SDfile   Computed 3D by Vconf -m prep SDfile
Find this compound or compounds like it in BindingDB:
Activity Spreadsheet -- Enzyme Inhibition Constant Data from BindingDB
Found 1 hit for monomerid = 50209171
TargetSodium-dependent serotonin transporter(Homo sapiens (Human))
Bristol-Myers Squibb Pharmaceutical Research Institute
Curated by ChEMBL
LigandPNGBDBM50209171(4-(5-bromo-1H-indol-3-yl)-N,N-dimethylcyclohex-3-e...)
Affinity DataIC50:  5.30nM. Assay description: Displacement of [3H]citalopram from human SERT expressed in HEK293 cells
In DepthDetails ArticlePubMed