BDBM50209275 (S)-N-(1-isobutylpiperidin-4-yl)-1-(naphthalen-2-ylsulfonyl)pyrrolidine-2-carboxamide::CHEMBL246584
SMILES CC(C)CN1CCC(CC1)NC(=O)[C@@H]1CCCN1S(=O)(=O)c1ccc2ccccc2c1
InChI Key InChIKey=AOWXTMWQPFORIG-QHCPKHFHSA-N
Data  1 KI
  Tab Delimited (TSV)   2D SDfile   Computed 3D by Vconf -m prep SDfile
Find this compound or compounds like it in BindingDB:
Activity Spreadsheet -- Enzyme Inhibition Constant Data from BindingDB
Found 1 hit for monomerid = 50209275
TargetC-C chemokine receptor type 4(Homo sapiens (Human))
Millennium Pharmaceuticals
Curated by ChEMBL
LigandPNGBDBM50209275((S)-N-(1-isobutylpiperidin-4-yl)-1-(naphthalen-2-y...)
Affinity DataKi:  1.00E+4nM. Assay description: Displacement of human MDC from recombinant CCR4 receptor expressed in CHO cells coexpressing Galpha16 by FLIPR assay
In DepthDetails ArticlePubMed