BDBM50209455 (3R)-3-(2-(3-amino-5-(5-hydroxy-1,4,5,6-tetrahydropyrimidin-2-ylamino)benzamido)acetamido)-3-(3-bromo-5-chloro-2-hydroxyphenyl)propanoic acid::CHEMBL242707
SMILES [#7]-c1cc(cc(c1)-[#6](=O)-[#7]-[#6]-[#6](=O)-[#7]-[#6@H](-[#6]-[#6](-[#8])=O)-c1cc(Cl)cc(Br)c1-[#8])\[#7]=[#6]-1\[#7]-[#6]-[#6](-[#8])-[#6]-[#7]-1
InChI Key InChIKey=IFSFMYKCQAKBNP-QGZVFWFLSA-N
Data  2 IC50
  Tab Delimited (TSV)   2D SDfile   Computed 3D by Vconf -m prep SDfile
Find this compound or compounds like it in BindingDB:
Activity Spreadsheet -- Enzyme Inhibition Constant Data from BindingDB
Found 2 hits for monomerid = 50209455
TargetIntegrin alpha-V/beta-6(Homo sapiens (Human))
Pfizer
Curated by ChEMBL
LigandPNGBDBM50209455((3R)-3-(2-(3-amino-5-(5-hydroxy-1,4,5,6-tetrahydro...)
Affinity DataIC50:  8.62E+3nM. Assay description: Inhibition of alphaVbeta6 integrin receptor in human HT29 cells
In DepthDetails ArticlePubMed
TargetIntegrin alpha-V/beta-3(Homo sapiens (Human))
Pfizer
Curated by ChEMBL
LigandPNGBDBM50209455((3R)-3-(2-(3-amino-5-(5-hydroxy-1,4,5,6-tetrahydro...)
Affinity DataIC50:  22nM. Assay description: Inhibition of alphaVbeta3 integrin receptor expressed in human 293 cells
In DepthDetails ArticlePubMed