BDBM50209519 4-[3-cyano-2-(2'-ethoxy-3-fluoro-biphenyl-4-yl)-6-fluoro-quinolin-4-ylamino]-butyric acid::CHEMBL246141
SMILES CCOc1ccccc1-c1ccc(c(F)c1)-c1nc2ccc(F)cc2c(NCCCC(O)=O)c1C#N
InChI Key InChIKey=FLVLDGXVABQQQI-UHFFFAOYSA-N
Data  1 IC50
  Tab Delimited (TSV)   2D SDfile   Computed 3D by Vconf -m prep SDfile
Find this compound or compounds like it in BindingDB:
Activity Spreadsheet -- Enzyme Inhibition Constant Data from BindingDB
Found 1 hit for monomerid = 50209519
TargetcAMP and cAMP-inhibited cGMP 3',5'-cyclic phosphodiesterase 10A(Homo sapiens (Human))
Bayer Pharmaceuticals
Curated by ChEMBL
LigandPNGBDBM50209519(4-[3-cyano-2-(2'-ethoxy-3-fluoro-biphenyl-4-yl)-6-...)
Affinity DataIC50:  4nM. Assay description: Inhibition of human recombinant PDE10A transfected in insect Sf9 cells by scintillation proximity assay
In DepthDetails ArticlePubMed