BDBM50209597 CHEMBL268297::[D-Ncy(methyl)4]acyline
SMILES CS[C@@H](NC(=O)[C@@H](Cc1cccnc1)NC(=O)[C@@H](Cc1ccc(Cl)cc1)NC(=O)[C@@H](Cc1ccc2ccccc2c1)NC(C)=O)C(=O)N[C@@H](Cc1ccc(NC(C)=O)cc1)C(=O)N[C@H](Cc1ccc(NC(C)=O)cc1)C(=O)N[C@@H](CC(C)C)C(=O)N[C@@H](CCCCNC(C)C)C(=O)N1CCC[C@H]1C(=O)N[C@H](C)C(N)=O
InChI Key InChIKey=HPTFWQIEIVLQOX-GHGJXBRZSA-N
Data  1 IC50
  Tab Delimited (TSV)   2D SDfile   Computed 3D by Vconf -m prep SDfile
Find this compound or compounds like it in BindingDB:
Activity Spreadsheet -- Enzyme Inhibition Constant Data from BindingDB
Found 1 hit for monomerid = 50209597
TargetGonadotropin-releasing hormone receptor(Homo sapiens (Human))
Salk Institute
Curated by ChEMBL
LigandPNGBDBM50209597(CHEMBL268297 | [D-Ncy(methyl)4]acyline)
Affinity DataIC50:  25nM. Assay description: Antagonist activity at human GnRHR expressed in HEK293 cells assessed as inhibition of GnRH-induced luciferase response by reporter gene assay
In DepthDetails ArticlePubMed