BDBM50209822 3-(4-(2-carboxy-1H-pyrrol-1-yl)benzyl)-2-methyl-3H-benzo[d]imidazole-4-carboxylic acid::CHEMBL442251
SMILES Cc1nc2cccc(C(O)=O)c2n1Cc1ccc(cc1)-n1cccc1C(O)=O
InChI Key InChIKey=YPWNUJLWQPHPNY-UHFFFAOYSA-N
Data  1 IC50
  Tab Delimited (TSV)   2D SDfile   Computed 3D by Vconf -m prep SDfile
Find this compound or compounds like it in BindingDB:
Activity Spreadsheet -- Enzyme Inhibition Constant Data from BindingDB
Found 1 hit for monomerid = 50209822
TargetType-1 angiotensin II receptor(Bos taurus)
China Pharmaceutical University
Curated by ChEMBL
LigandPNGBDBM50209822(3-(4-(2-carboxy-1H-pyrrol-1-yl)benzyl)-2-methyl-3H...)
Affinity DataIC50:  250nM. Assay description: Displacement of [125I]angiotensin-2 from bovine adrenal cortex AT1 receptor
In DepthDetails ArticlePubMed