BDBM50209854 CHEMBL3884634
SMILES O=c1cc(ncn1CCCCCN1CCN(Cc2ccccc2)CC1)-c1ccccc1
InChI Key InChIKey=ZNABTQZRXWSHES-UHFFFAOYSA-N
Data  2 KI
  Tab Delimited (TSV)   2D SDfile   Computed 3D by Vconf -m prep SDfile
Find this compound or compounds like it in BindingDB:
Activity Spreadsheet -- Enzyme Inhibition Constant Data from BindingDB
Found 2 hits for monomerid = 50209854
Target5-hydroxytryptamine receptor 1A(Homo sapiens (Human))
Universit£
Curated by ChEMBL
LigandPNGBDBM50209854(CHEMBL3884634)
Affinity DataKi:  772nM. Assay description: Displacement of [3H]-8-OH-DPAT from recombinant human 5-HT1A receptor expressed in CHOK1 cell membranes after 1 hr by liquid scintillation counting m...
In DepthDetails ArticlePubMed
Target5-hydroxytryptamine receptor 7(Homo sapiens (Human))
Universit£
Curated by ChEMBL
LigandPNGBDBM50209854(CHEMBL3884634)
Affinity DataKi:  1.33E+3nM. Assay description: Displacement of [3H]-5-HT from recombinant human 5-HT7A receptor expressed in CHOK1 cell membranes after 40 mins by liquid scintillation counting met...
In DepthDetails ArticlePubMed