BDBM50210000 1-((3R,4R)-3-(((S)-3-(4-fluorobenzyl)piperidin-1-yl)methyl)-1-(cyclopropylmethyl)piperidin-4-yl)-3-(5-acetyl-4-methylthiazol-2-yl)urea::CHEMBL251623
SMILES CC(=O)c1sc(NC(=O)N[C@@H]2CCN(CC3CC3)C[C@H]2CN2CCC[C@@H](Cc3ccc(F)cc3)C2)nc1C
InChI Key InChIKey=GIMZSPHDTTYQLI-BFLUCZKCSA-N
Data  2 IC50
  Tab Delimited (TSV)   2D SDfile   Computed 3D by Vconf -m prep SDfile
Find this compound or compounds like it in BindingDB:
Activity Spreadsheet -- Enzyme Inhibition Constant Data from BindingDB
Found 2 hits for monomerid = 50210000
TargetCytochrome P450 2D6(Homo sapiens (Human))
Bristol-Myers Squibb Pharmaceutical Research Institute
Curated by ChEMBL
LigandPNGBDBM50210000(1-((3R,4R)-3-(((S)-3-(4-fluorobenzyl)piperidin-1-y...)
Affinity DataIC50:  920nM. Assay description: Inhibition of human recombinant CYP2D6
In DepthDetails ArticlePubMed
TargetC-C chemokine receptor type 3(Homo sapiens (Human))
Bristol-Myers Squibb Pharmaceutical Research Institute
Curated by ChEMBL
LigandPNGBDBM50210000(1-((3R,4R)-3-(((S)-3-(4-fluorobenzyl)piperidin-1-y...)
Affinity DataIC50:  4nM. Assay description: Displacement of [125I]eotaxin from human CCR3 expressed in CHO cells after 30 mins
In DepthDetails ArticlePubMed