BDBM50210369 CHEMBL234513::methyl 3-(1-cyano-4-((3-(3,3,3-trifluoropropanamido)pyridin-2-ylamino)methyl)cyclohexyl)benzoate
SMILES COC(=O)c1cccc(c1)C1(CCC(CNc2ncccc2NC(=O)CC(F)(F)F)CC1)C#N
InChI Key InChIKey=IOLUJZGVPDEYNM-UHFFFAOYSA-N
Data  1 KI
  Tab Delimited (TSV)   2D SDfile   Computed 3D by Vconf -m prep SDfile
Find this compound or compounds like it in BindingDB:
Activity Spreadsheet -- Enzyme Inhibition Constant Data from BindingDB
Found 1 hit for monomerid = 50210369
TargetB1 bradykinin receptor(Homo sapiens (Human))
Merck
Curated by ChEMBL
LigandPNGBDBM50210369(CHEMBL234513 | methyl 3-(1-cyano-4-((3-(3,3,3-trif...)
Affinity DataKi:  49nM. Assay description: Binding affinity at human bradykinin B1 receptor
In DepthDetails ArticlePubMed