BDBM50210715 CHEMBL230807::N1-((2S,3R)-4-(3-methoxybenzylamino)-3-hydroxy-1-phenylbutan-2-yl)-N3,N3-dimethyl-N5,N5-dipropylbenzene-1,3,5-tricarboxamide
SMILES CCCN(CCC)C(=O)c1cc(cc(c1)C(=O)N(C)C)C(=O)N[C@@H](Cc1ccccc1)[C@H](O)CNCc1cccc(OC)c1
InChI Key InChIKey=WJRWIEVAQULAJW-AJQTZOPKSA-N
Data  2 IC50
  Tab Delimited (TSV)   2D SDfile   Computed 3D by Vconf -m prep SDfile
Find this compound or compounds like it in BindingDB:
Activity Spreadsheet -- Enzyme Inhibition Constant Data from BindingDB
Found 2 hits for monomerid = 50210715
TargetCathepsin D(Homo sapiens (Human))
Pfizer
Curated by ChEMBL
LigandPNGBDBM50210715(CHEMBL230807 | N1-((2S,3R)-4-(3-methoxybenzylamino...)
Affinity DataIC50:  3.80E+3nM. Assay description: Inhibition of cathepsin D
In DepthDetails ArticlePubMed
TargetBeta-secretase 1(Homo sapiens (Human))
Pfizer
Curated by ChEMBL
LigandPNGBDBM50210715(CHEMBL230807 | N1-((2S,3R)-4-(3-methoxybenzylamino...)
Affinity DataIC50:  70nM. Assay description: Inhibition of BACE1
In DepthDetails ArticlePubMed