BDBM50210830 CHEMBL3907757
SMILES O=C1N(CCCCN2CCN(Cc3ccccc3)CC2)S(=O)(=O)c2ccccc12
InChI Key InChIKey=GVBDSPHWJXJGMQ-UHFFFAOYSA-N
Data  1 IC50
  Tab Delimited (TSV)   2D SDfile   Computed 3D by Vconf -m prep SDfile
Find this compound or compounds like it in BindingDB:
Activity Spreadsheet -- Enzyme Inhibition Constant Data from BindingDB
Found 1 hit for monomerid = 50210830
TargetAcetylcholinesterase(Electrophorus electricus (Electric eel))
Jagiellonian University Medical College
Curated by ChEMBL
LigandPNGBDBM50210830(CHEMBL3907757)
Affinity DataIC50:  3.01E+3nM. Assay description: Inhibition of Electric eel AChE using acetylthiocholine iodide as substrate preincubated for 5 mins followed by substrate addition measured after 5 m...
In DepthDetails ArticlePubMed