BDBM50210851 CHEMBL3962358
SMILES O=C1CCCc2c1c1ccccc1n2CCc1ccccc1
InChI Key InChIKey=LWNZKUWDEYKUNL-UHFFFAOYSA-N
Data  2 IC50
  Tab Delimited (TSV)   2D SDfile   Computed 3D by Vconf -m prep SDfile
Find this compound or compounds like it in BindingDB:
Activity Spreadsheet -- Enzyme Inhibition Constant Data from BindingDB
Found 2 hits for monomerid = 50210851
TargetAcetylcholinesterase(Electrophorus electricus (Electric eel))
University Of Bari&Quot;A. Moro&Quot
Curated by ChEMBL
LigandPNGBDBM50210851(CHEMBL3962358)
Affinity DataIC50:  1.00E+4nM. Assay description: Inhibition of electric eel AChE pretreated for 20 mins followed by acetylthiocholine iodide substrate addition measured for 5 mins by Ellman's method
In DepthDetails ArticlePubMed
TargetCholinesterase(Equus caballus (Horse))
University Of Bari&Quot;A. Moro&Quot
Curated by ChEMBL
LigandPNGBDBM50210851(CHEMBL3962358)
Affinity DataIC50:  1.00E+4nM. Assay description: Inhibition of horse serum BChE pretreated for 20 mins followed by butyrylthiocholine iodide substrate addition measured for 5 mins by Ellman's method
In DepthDetails ArticlePubMed