BDBM50210891 1-(1-(4-(trifluoromethyl)benzoyl)piperidin-4-yl)-1H-benzo[d]imidazol-2(3H)-one::CHEMBL248576
SMILES FC(F)(F)c1ccc(cc1)C(=O)N1CCC(CC1)n1c2ccccc2[nH]c1=O
InChI Key InChIKey=PUSXLGUWMXMWAT-UHFFFAOYSA-N
Data  1 KI
  Tab Delimited (TSV)   2D SDfile   Computed 3D by Vconf -m prep SDfile
Find this compound or compounds like it in BindingDB:
Activity Spreadsheet -- Enzyme Inhibition Constant Data from BindingDB
Found 1 hit for monomerid = 50210891
Target11-beta-hydroxysteroid dehydrogenase 1(Homo sapiens (Human))
Biovitrum
Curated by ChEMBL
LigandPNGBDBM50210891(1-(1-(4-(trifluoromethyl)benzoyl)piperidin-4-yl)-1...)
Affinity DataKi:  2.60E+3nM. Assay description: Inhibition of human 11betaHSD1 by SPA
In DepthDetails ArticlePubMed