BDBM50211250 1-methyl-1-[3-(7-oxo-7H-1-aza-benzo[de]anthracen-9-ylcarbamoyl)-propyl]-pyrrolidinium::CHEMBL396158
SMILES C[N+]1(CCCC(=O)Nc2ccc-3c(c2)C(=O)c2cccc4ccnc-3c24)CCCC1
InChI Key InChIKey=LTXZRZOBWUSZAK-UHFFFAOYSA-O
Data  2 IC50
  Tab Delimited (TSV)   2D SDfile   Computed 3D by Vconf -m prep SDfile
Find this compound or compounds like it in BindingDB:
Activity Spreadsheet -- Enzyme Inhibition Constant Data from BindingDB
Found 2 hits for monomerid = 50211250
TargetCarboxylic ester hydrolase(Equus caballus (Horse))
Sun Yat-Sen University
Curated by ChEMBL
LigandPNGBDBM50211250(1-methyl-1-[3-(7-oxo-7H-1-aza-benzo[de]anthracen-9...)
Affinity DataIC50:  3.23E+3nM. Assay description: Inhibition of equine serum BuChE
In DepthDetails ArticlePubMed
TargetAcetylcholinesterase(Electrophorus electricus (Electric eel))
Sun Yat-Sen University
Curated by ChEMBL
LigandPNGBDBM50211250(1-methyl-1-[3-(7-oxo-7H-1-aza-benzo[de]anthracen-9...)
Affinity DataIC50:  2.51nM. Assay description: Inhibition of electric eel AChE
In DepthDetails ArticlePubMed