BDBM50211274 CHEMBL3916842
SMILES OC(c1cnn(n1)C(=O)N1CCCCC1COc1ccccc1)(c1ccc(F)cc1)c1ccc(F)cc1
InChI Key InChIKey=WDIBAIMOQFGINL-UHFFFAOYSA-N
Data  2 IC50
  Tab Delimited (TSV)   2D SDfile   Computed 3D by Vconf -m prep SDfile
Find this compound or compounds like it in BindingDB:
Activity Spreadsheet -- Enzyme Inhibition Constant Data from BindingDB
Found 2 hits for monomerid = 50211274
TargetDiacylglycerol lipase-alpha(Homo sapiens (Human))
Leiden University
Curated by ChEMBL
LigandPNGBDBM50211274(CHEMBL3916842)
Affinity DataIC50:  5nM. Assay description: Inhibition of recombinant human DAGLalpha expressed in HEK293T cell membranes overexpressing MAGL using natural substrate 1-stearoyl-2-arachidonoly-s...
In DepthDetails ArticlePubMed
TargetMonoacylglycerol lipase ABHD6(Homo sapiens (Human))
Leiden University
Curated by ChEMBL
LigandPNGBDBM50211274(CHEMBL3916842)
Affinity DataIC50:  200nM. Assay description: Inhibition of human ABHD6 using 2-AG as natural substrate by fluorescence based assay
In DepthDetails ArticlePubMed