BDBM50211322 CHEMBL391530::N-((1s,4s)-4-(4-(2-isopropoxyphenyl)piperazin-1-yl)cyclohexyl)-3,4-dimethoxybenzenesulfonamide
SMILES COc1ccc(cc1OC)S(=O)(=O)N[C@H]1CC[C@H](CC1)N1CCN(CC1)c1ccccc1OC(C)C
InChI Key InChIKey=YJXYZPLPRPNAPZ-SZPZYZBQSA-N
Data  12 KI
  Tab Delimited (TSV)   2D SDfile   Computed 3D by Vconf -m prep SDfile
Find this compound or compounds like it in BindingDB:
Activity Spreadsheet -- Enzyme Inhibition Constant Data from BindingDB
Found 12 hits for monomerid = 50211322
TargetAlpha-1D adrenergic receptor(Homo sapiens (Human))
Johnson & Johnson Pharmaceutical Research And Development
Curated by ChEMBL
LigandPNGBDBM50211322(CHEMBL391530 | N-((1s,4s)-4-(4-(2-isopropoxyphenyl...)
Affinity DataKi:  0.680nM. Assay description: Binding affinity to human cloned adrenergic alpha1d receptor
In DepthDetails ArticlePubMed
TargetAlpha-1A adrenergic receptor(Homo sapiens (Human))
Johnson & Johnson Pharmaceutical Research And Development
Curated by ChEMBL
LigandPNGBDBM50211322(CHEMBL391530 | N-((1s,4s)-4-(4-(2-isopropoxyphenyl...)
Affinity DataKi:  2nM. Assay description: Binding affinity to human cloned adrenergic alpha1a receptor
In DepthDetails ArticlePubMed
TargetAlpha-1D adrenergic receptor(Homo sapiens (Human))
Johnson & Johnson Pharmaceutical Research And Development
Curated by ChEMBL
LigandPNGBDBM50211322(CHEMBL391530 | N-((1s,4s)-4-(4-(2-isopropoxyphenyl...)
Affinity DataKi:  19nM. Assay description: Binding affinity to human cloned adrenergic alpha1D receptor
In DepthDetails ArticlePubMed
TargetAlpha-1D adrenergic receptor(Homo sapiens (Human))
Johnson & Johnson Pharmaceutical Research And Development
Curated by ChEMBL
LigandPNGBDBM50211322(CHEMBL391530 | N-((1s,4s)-4-(4-(2-isopropoxyphenyl...)
Affinity DataKi:  19nM. Assay description: Binding affinity to human cloned adrenergic alpha1D receptor
In DepthDetails ArticlePubMed
TargetAlpha-1A adrenergic receptor(Homo sapiens (Human))
Johnson & Johnson Pharmaceutical Research And Development
Curated by ChEMBL
LigandPNGBDBM50211322(CHEMBL391530 | N-((1s,4s)-4-(4-(2-isopropoxyphenyl...)
Affinity DataKi:  61nM. Assay description: Binding affinity to human cloned adrenergic alpha1A receptor
In DepthDetails ArticlePubMed
TargetAlpha-1A adrenergic receptor(Homo sapiens (Human))
Johnson & Johnson Pharmaceutical Research And Development
Curated by ChEMBL
LigandPNGBDBM50211322(CHEMBL391530 | N-((1s,4s)-4-(4-(2-isopropoxyphenyl...)
Affinity DataKi:  61nM. Assay description: Binding affinity to human cloned adrenergic alpha1A receptor
In DepthDetails ArticlePubMed
TargetAlpha-1B adrenergic receptor(Homo sapiens (Human))
Johnson & Johnson Pharmaceutical Research And Development
Curated by ChEMBL
LigandPNGBDBM50211322(CHEMBL391530 | N-((1s,4s)-4-(4-(2-isopropoxyphenyl...)
Affinity DataKi:  106nM. Assay description: Binding affinity to human cloned adrenergic alpha1b receptor
In DepthDetails ArticlePubMed
TargetAlpha-1B adrenergic receptor(Homo sapiens (Human))
Johnson & Johnson Pharmaceutical Research And Development
Curated by ChEMBL
LigandPNGBDBM50211322(CHEMBL391530 | N-((1s,4s)-4-(4-(2-isopropoxyphenyl...)
Affinity DataKi:  109nM. Assay description: Binding affinity to human cloned adrenergic alpha1B receptor
In DepthDetails ArticlePubMed
TargetAlpha-1B adrenergic receptor(Homo sapiens (Human))
Johnson & Johnson Pharmaceutical Research And Development
Curated by ChEMBL
LigandPNGBDBM50211322(CHEMBL391530 | N-((1s,4s)-4-(4-(2-isopropoxyphenyl...)
Affinity DataKi:  112nM. Assay description: Binding affinity to human cloned adrenergic alpha1B receptor
In DepthDetails ArticlePubMed
TargetD(2) dopamine receptor(Homo sapiens (Human))
Johnson & Johnson Pharmaceutical Research And Development
Curated by ChEMBL
LigandPNGBDBM50211322(CHEMBL391530 | N-((1s,4s)-4-(4-(2-isopropoxyphenyl...)
Affinity DataKi:  136nM. Assay description: Binding affinity to human cloned dopamine D2 receptor
In DepthDetails ArticlePubMed
TargetD(2) dopamine receptor(Homo sapiens (Human))
Johnson & Johnson Pharmaceutical Research And Development
Curated by ChEMBL
LigandPNGBDBM50211322(CHEMBL391530 | N-((1s,4s)-4-(4-(2-isopropoxyphenyl...)
Affinity DataKi:  810nM. Assay description: Binding affinity to human dopamine D2 receptor
In DepthDetails ArticlePubMed
TargetD(2) dopamine receptor(Homo sapiens (Human))
Johnson & Johnson Pharmaceutical Research And Development
Curated by ChEMBL
LigandPNGBDBM50211322(CHEMBL391530 | N-((1s,4s)-4-(4-(2-isopropoxyphenyl...)
Affinity DataKi:  810nM. Assay description: Binding affinity to human dopamine D2 receptor
In DepthDetails ArticlePubMed