BDBM50211393 Ac-Nle4-cyclo(Asp5-Oic6-D-4,4'-Bic7-Pip8-Trp9-Lys10)-NH2::CHEMBL2371972
SMILES [H][C@]12CC3CCCCC3N1C(=O)[C@H](CC(=O)NCCCC[C@H](NC(=O)[C@H](Cc1c[nH]c3ccccc13)NC(=O)[C@]1([H])CCCCN1C(=O)[C@H](CC1CCC(CC1)C1CCCCC1)NC2=O)C(N)=O)NC(=O)[C@H](CCCC)NC(C)=O
InChI Key InChIKey=YDVSNISNWOTEQM-ZJHSHMMASA-N
Data  3 IC50  2 EC50
  Tab Delimited (TSV)   2D SDfile   Computed 3D by Vconf -m prep SDfile
Find this compound or compounds like it in BindingDB:
Activity Spreadsheet -- Enzyme Inhibition Constant Data from BindingDB
Found 5 hits for monomerid = 50211393
TargetMelanocortin receptor 5(Homo sapiens (Human))
Merck Research Laboratories
Curated by ChEMBL
LigandPNGBDBM50211393(Ac-Nle4-cyclo(Asp5-Oic6-D-4,4'-Bic7-Pip8-Trp9-Lys1...)
Affinity DataEC50: >500nM. Assay description: Agonist activity at human MC5R expressed in CHO cells assessed as cAMP accumulation
In DepthDetails ArticlePubMed
TargetMelanocortin receptor 3(Homo sapiens (Human))
Merck Research Laboratories
Curated by ChEMBL
LigandPNGBDBM50211393(Ac-Nle4-cyclo(Asp5-Oic6-D-4,4'-Bic7-Pip8-Trp9-Lys1...)
Affinity DataIC50: >1.00E+3nM. Assay description: Displacement of [125I]NDPalphaMSH from human cloned MC3R expressed in CHO cells
In DepthDetails ArticlePubMed
TargetMelanocortin receptor 5(Homo sapiens (Human))
Merck Research Laboratories
Curated by ChEMBL
LigandPNGBDBM50211393(Ac-Nle4-cyclo(Asp5-Oic6-D-4,4'-Bic7-Pip8-Trp9-Lys1...)
Affinity DataIC50:  700nM. Assay description: Displacement of [125I]NDPalphaMSH from human cloned MC5R expressed in CHO cells
In DepthDetails ArticlePubMed
TargetMelanocyte-stimulating hormone receptor(Homo sapiens (Human))
Merck Research Laboratories
Curated by ChEMBL
LigandPNGBDBM50211393(Ac-Nle4-cyclo(Asp5-Oic6-D-4,4'-Bic7-Pip8-Trp9-Lys1...)
Affinity DataIC50:  1.30E+3nM. Assay description: Displacement of [125I]NDPalphaMSH from human cloned melanocortin receptor 1b expressed in CHO cells
In DepthDetails ArticlePubMed
TargetMelanocortin receptor 3(Homo sapiens (Human))
Merck Research Laboratories
Curated by ChEMBL
LigandPNGBDBM50211393(Ac-Nle4-cyclo(Asp5-Oic6-D-4,4'-Bic7-Pip8-Trp9-Lys1...)
Affinity DataEC50: >500nM. Assay description: Agonist activity at human MC3R expressed in CHO cells assessed as cAMP accumulation
In DepthDetails ArticlePubMed