BDBM50211709 CHEMBL3926030
SMILES NCCO.OC(=O)c1[nH]c(=O)[nH]c(=O)c1CCc1cc(cc(c1)C(F)(F)F)C(F)(F)F
InChI Key InChIKey=STCWNIVPPBDNGW-UHFFFAOYSA-N
Data  1 KI  1 IC50
  Tab Delimited (TSV)   2D SDfile   Computed 3D by Vconf -m prep SDfile
Find this compound or compounds like it in BindingDB:
Activity Spreadsheet -- Enzyme Inhibition Constant Data from BindingDB
Found 2 hits for monomerid = 50211709
TargetDihydroorotate dehydrogenase (quinone), mitochondrial(Homo sapiens (Human))
Nagasaki University
Curated by ChEMBL
LigandPNGBDBM50211709(CHEMBL3926030)
Affinity DataKi:  5.70E+3nM. Assay description: Inhibition of human dihydroorotate dehydrogenase assessed as reduction in orotate production using L-dihydroorotate as substrate measured after 20 mi...
In DepthDetails ArticlePubMed
TargetDihydroorotate dehydrogenase (quinone), mitochondrial(Homo sapiens (Human))
Nagasaki University
Curated by ChEMBL
LigandPNGBDBM50211709(CHEMBL3926030)
Affinity DataIC50:  11nM. Assay description: Inhibition of human dihydroorotate dehydrogenase assessed as reduction in orotate production using L-dihydroorotate as substrate measured after 20 mi...
In DepthDetails ArticlePubMed