BDBM50211894 5-(4-(dimethylamino)benzylidene)-3-(4-hydroxyphenyl)-2-thioxothiazolidin-4-one::CHEMBL376618
SMILES CN(C)c1ccc(\C=C2/SC(=S)N(C2=O)c2ccc(O)cc2)cc1
InChI Key InChIKey=DBROGSOZCBHQTN-WJDWOHSUSA-N
Data  1 IC50
  Tab Delimited (TSV)   2D SDfile   Computed 3D by Vconf -m prep SDfile
Find this compound or compounds like it in BindingDB:
Activity Spreadsheet -- Enzyme Inhibition Constant Data from BindingDB
Found 1 hit for monomerid = 50211894
TargetEnoyl-acyl-carrier protein reductase(Plasmodium falciparum)
Institute Of Science
Curated by ChEMBL
LigandPNGBDBM50211894(5-(4-(dimethylamino)benzylidene)-3-(4-hydroxypheny...)
Affinity DataIC50:  870nM. Assay description: Inhibition of Plasmodium falciparum recombinant enoyl ACP reductase expressed in BL21 (DE3) cells
In DepthDetails ArticlePubMed