BDBM50212320 CHEMBL274514
SMILES COc1ccc(cc1)C1Sc2ccccc2-n2c(CNCCc3ccc(OC)c(OC)c3)ccc12
InChI Key InChIKey=FUMZQPBWMHAUOB-UHFFFAOYSA-N
Data  1 KI  1 IC50
  Tab Delimited (TSV)   2D SDfile   Computed 3D by Vconf -m prep SDfile
Find this compound or compounds like it in BindingDB:
Activity Spreadsheet -- Enzyme Inhibition Constant Data from BindingDB
Found 2 hits for monomerid = 50212320
LigandPNGBDBM50212320(CHEMBL274514)
Affinity DataKi:  200nM. Assay description: Displacement of [3H]nitrendipine from calcium channel receptor
In DepthDetails
LigandPNGBDBM50212320(CHEMBL274514)
Affinity DataIC50:  534nM. Assay description: Displacement of [3H]nitrendipine from calcium channel receptor
In DepthDetails