BDBM50212585 CHEMBL167175
SMILES O[C@H]1CCN(CC#CCN2CCCC2=O)C1
InChI Key InChIKey=SFEDJEMAAZWXLR-NSHDSACASA-N
Data  2 KI
  Tab Delimited (TSV)   2D SDfile   Computed 3D by Vconf -m prep SDfile
Find this compound or compounds like it in BindingDB:
Activity Spreadsheet -- Enzyme Inhibition Constant Data from BindingDB
Found 2 hits for monomerid = 50212585
LigandPNGBDBM50212585(CHEMBL167175)
Affinity DataKi:  610nM. Assay description: In vitro ability to displace 3H-cis-methyltrimethylammoniummethyl-1,3-dioxolane [3H]CD) from rat cortical Muscarinic acetylcholine receptor in compet...
In DepthDetails
LigandPNGBDBM50212585(CHEMBL167175)
Affinity DataKi:  1.20E+3nM. Assay description: In vitro ability to displace [3H]quinuclidinyl benzilate [3H]QNB) from rat cortical Muscarinic acetylcholine receptor in competition assay
In DepthDetails