BDBM50212956 4-(4-phenylbutyl)benzene-1,2-diol::CHEMBL442420
SMILES Oc1ccc(CCCCc2ccccc2)cc1O
InChI Key InChIKey=PEMMCHVJDAVCMU-UHFFFAOYSA-N
Data  2 IC50
  Tab Delimited (TSV)   2D SDfile   Computed 3D by Vconf -m prep SDfile
Find this compound or compounds like it in BindingDB:
Activity Spreadsheet -- Enzyme Inhibition Constant Data from BindingDB
Found 2 hits for monomerid = 50212956
TargetPolyunsaturated fatty acid lipoxygenase ALOX15(Homo sapiens (Human))
San Francisco State University
Curated by ChEMBL
LigandPNGBDBM50212956(4-(4-phenylbutyl)benzene-1,2-diol | CHEMBL442420)
Affinity DataIC50:  7.30E+3nM. Assay description: Inhibition of 15 LOX
In DepthDetails ArticlePubMed
TargetInsulin-like growth factor 1 receptor(Homo sapiens (Human))
San Francisco State University
Curated by ChEMBL
LigandPNGBDBM50212956(4-(4-phenylbutyl)benzene-1,2-diol | CHEMBL442420)
Affinity DataIC50:  800nM. Assay description: Inhibition of IGF1R
In DepthDetails ArticlePubMed