BDBM50212958 4-(4-(3,4-dihydroxyphenyl)butyl)benzene-1,2-diol::CHEMBL245952
SMILES Oc1ccc(CCCCc2ccc(O)c(O)c2)cc1O
InChI Key InChIKey=JMYXNUMGPRHHBC-UHFFFAOYSA-N
Data  2 IC50
  Tab Delimited (TSV)   2D SDfile   Computed 3D by Vconf -m prep SDfile
Find this compound or compounds like it in BindingDB:
Activity Spreadsheet -- Enzyme Inhibition Constant Data from BindingDB
Found 2 hits for monomerid = 50212958
TargetInsulin-like growth factor 1 receptor(Homo sapiens (Human))
San Francisco State University
Curated by ChEMBL
LigandPNGBDBM50212958(4-(4-(3,4-dihydroxyphenyl)butyl)benzene-1,2-diol |...)
Affinity DataIC50:  600nM. Assay description: Inhibition of IGF1R
In DepthDetails ArticlePubMed
TargetPolyunsaturated fatty acid lipoxygenase ALOX15(Homo sapiens (Human))
San Francisco State University
Curated by ChEMBL
LigandPNGBDBM50212958(4-(4-(3,4-dihydroxyphenyl)butyl)benzene-1,2-diol |...)
Affinity DataIC50:  3.90E+3nM. Assay description: Inhibition of 15 LOX
In DepthDetails ArticlePubMed