BDBM50213019 CHEMBL309655
SMILES COc1cc(N)c(Cl)cc1C(=O)CCCN1CCCCC1
InChI Key InChIKey=XJWVURLHVIPCJI-UHFFFAOYSA-N
Data  1 EC50
  Tab Delimited (TSV)   2D SDfile   Computed 3D by Vconf -m prep SDfile
Find this compound or compounds like it in BindingDB:
Activity Spreadsheet -- Enzyme Inhibition Constant Data from BindingDB
Found 1 hit for monomerid = 50213019
Target5-hydroxytryptamine receptor 4(Homo sapiens (Human))TBA
LigandPNGBDBM50213019(CHEMBL309655)
Affinity DataEC50:  316nM. Assay description: Agonist activity against 5-HT4 receptor in rat esophageal muscularis mucosae
In DepthDetails