BDBM50213414 CHEMBL240528::afzelin::kaempferol 3-O-alpha-L-rhamnopyranoside::kaempferol 3-O-rhamnoside::kaempferol-3-O-alpha-L-rhamnopyranoside::kaempferol-3-O-alpha-L-rhamnoside
SMILES C[C@@H]1O[C@@H](Oc2c(O)c3c(cc(O)cc3=O)oc2-c2ccc(O)cc2)[C@H](O)[C@H](O)[C@H]1O
InChI Key InChIKey=ZWCVYHPDDFISLG-AEIZVZFYSA-N
Data  6 IC50
  Tab Delimited (TSV)   2D SDfile   Computed 3D by Vconf -m prep SDfile
Find this compound or compounds like it in BindingDB:
Activity Spreadsheet -- Enzyme Inhibition Constant Data from BindingDB
Found 6 hits for monomerid = 50213414
TargetCytochrome P450 3A4(Homo sapiens (Human))
Toyama Medical And Pharmaceutical University
Curated by ChEMBL
LigandPNGBDBM50213414(CHEMBL240528 | afzelin | kaempferol 3-O-alpha-L-rh...)
Affinity DataIC50: >1.00E+5nM. Assay description: Inhibition of human CYP3A4 by radiometric assay
In DepthDetails ArticlePubMed
TargetCytochrome P450 2D6(Homo sapiens (Human))
Toyama Medical And Pharmaceutical University
Curated by ChEMBL
LigandPNGBDBM50213414(CHEMBL240528 | afzelin | kaempferol 3-O-alpha-L-rh...)
Affinity DataIC50: >1.00E+5nM. Assay description: Inhibition of human CYP2D6 by radiometric assay
In DepthDetails ArticlePubMed
TargetIntegrase(Human immunodeficiency virus 1)
Korea Institute Of Science & Technology
Curated by ChEMBL
LigandPNGBDBM50213414(CHEMBL240528 | afzelin | kaempferol 3-O-alpha-L-rh...)
Affinity DataIC50: >2.31E+5nM. Assay description: Inhibition of HIV1 recombinant integrase expressed in Escherichia coli
In DepthDetails ArticlePubMed
TargetE3 ubiquitin-protein ligase XIAP(Homo sapiens (Human))
University Of Innsbruck
Curated by ChEMBL
LigandPNGBDBM50213414(CHEMBL240528 | afzelin | kaempferol 3-O-alpha-L-rh...)
Affinity DataIC50: >1.00E+5nM. Assay description: Displacement of fluorescent SM5F peptide from XIAP linker BIR3 domain after 3 hrs by fluorescence polarization assay
In DepthDetails ArticlePubMed
TargetNitric oxide synthase, inducible(Mus musculus (mouse))
National Cheng Kung University
Curated by ChEMBL
LigandPNGBDBM50213414(CHEMBL240528 | afzelin | kaempferol 3-O-alpha-L-rh...)
Affinity DataIC50: >5.00E+4nM. Assay description: Inhibition of iNOS-mediated NO production in LPS-induced mouse BV2 cells
In DepthDetails ArticlePubMed
TargetPolyphenol oxidase 2(Agaricus bisporus (Common mushroom))
Amorepacific
Curated by ChEMBL
LigandPNGBDBM50213414(CHEMBL240528 | afzelin | kaempferol 3-O-alpha-L-rh...)
Affinity DataIC50: >4.00E+5nM. Assay description: Inhibition of mushroom tyrosinase after 20 mins by spectrophotometric analysis
In DepthDetails ArticlePubMed