BDBM50213511 CHEMBL229085::N-((1s,4s)-4-(4-(2-cyclopropoxyphenyl)piperidin-1-yl)cyclohexyl)-3,4-dimethoxybenzenesulfonamide
SMILES COc1ccc(cc1OC)S(=O)(=O)N[C@H]1CC[C@H](CC1)N1CCC(CC1)c1ccccc1OC1CC1
InChI Key InChIKey=JFRXSPVSGNWHOD-SZPZYZBQSA-N
Data  8 KI
  Tab Delimited (TSV)   2D SDfile   Computed 3D by Vconf -m prep SDfile
Find this compound or compounds like it in BindingDB:
Activity Spreadsheet -- Enzyme Inhibition Constant Data from BindingDB
Found 8 hits for monomerid = 50213511
TargetAlpha-1A adrenergic receptor(Homo sapiens (Human))
Johnson & Johnson Pharmaceutical Research And Development
Curated by ChEMBL
LigandPNGBDBM50213511(CHEMBL229085 | N-((1s,4s)-4-(4-(2-cyclopropoxyphen...)
Affinity DataKi:  0.910nM. Assay description: Binding affinity to human cloned adrenergic alpha1a receptor
In DepthDetails ArticlePubMed
TargetAlpha-1A adrenergic receptor(Homo sapiens (Human))
Johnson & Johnson Pharmaceutical Research And Development
Curated by ChEMBL
LigandPNGBDBM50213511(CHEMBL229085 | N-((1s,4s)-4-(4-(2-cyclopropoxyphen...)
Affinity DataKi:  0.910nM. Assay description: Binding affinity to human cloned adrenergic alpha1a receptor
In DepthDetails ArticlePubMed
TargetAlpha-1D adrenergic receptor(Homo sapiens (Human))
Johnson & Johnson Pharmaceutical Research And Development
Curated by ChEMBL
LigandPNGBDBM50213511(CHEMBL229085 | N-((1s,4s)-4-(4-(2-cyclopropoxyphen...)
Affinity DataKi:  2nM. Assay description: Binding affinity to human cloned adrenergic alpha1d receptor
In DepthDetails ArticlePubMed
TargetAlpha-1D adrenergic receptor(Homo sapiens (Human))
Johnson & Johnson Pharmaceutical Research And Development
Curated by ChEMBL
LigandPNGBDBM50213511(CHEMBL229085 | N-((1s,4s)-4-(4-(2-cyclopropoxyphen...)
Affinity DataKi:  2nM. Assay description: Binding affinity to human cloned adrenergic alpha1d receptor
In DepthDetails ArticlePubMed
TargetAlpha-1B adrenergic receptor(Homo sapiens (Human))
Johnson & Johnson Pharmaceutical Research And Development
Curated by ChEMBL
LigandPNGBDBM50213511(CHEMBL229085 | N-((1s,4s)-4-(4-(2-cyclopropoxyphen...)
Affinity DataKi:  141nM. Assay description: Binding affinity to human cloned adrenergic alpha1b receptor
In DepthDetails ArticlePubMed
TargetAlpha-1B adrenergic receptor(Homo sapiens (Human))
Johnson & Johnson Pharmaceutical Research And Development
Curated by ChEMBL
LigandPNGBDBM50213511(CHEMBL229085 | N-((1s,4s)-4-(4-(2-cyclopropoxyphen...)
Affinity DataKi:  141nM. Assay description: Binding affinity to human cloned adrenergic alpha1b receptor
In DepthDetails ArticlePubMed
TargetD(2) dopamine receptor(Homo sapiens (Human))
Johnson & Johnson Pharmaceutical Research And Development
Curated by ChEMBL
LigandPNGBDBM50213511(CHEMBL229085 | N-((1s,4s)-4-(4-(2-cyclopropoxyphen...)
Affinity DataKi:  144nM. Assay description: Binding affinity for dopamine D2 receptor
In DepthDetails ArticlePubMed
TargetD(2) dopamine receptor(Homo sapiens (Human))
Johnson & Johnson Pharmaceutical Research And Development
Curated by ChEMBL
LigandPNGBDBM50213511(CHEMBL229085 | N-((1s,4s)-4-(4-(2-cyclopropoxyphen...)
Affinity DataKi:  144nM. Assay description: Binding affinity to human cloned dopamine D2 receptor
In DepthDetails ArticlePubMed