BDBM50213613 (6aR,10aR)-3-tert-butyl-6,6,9-trimethyl-6a,7,10,10a-tetrahydro-6H-benzo[c]chromen-1-ol::CHEMBL276083
SMILES CC1=CC[C@@H]2[C@@H](C1)c1c(O)cc(cc1OC2(C)C)C(C)(C)C
InChI Key InChIKey=XPHADQVQXKHSBO-HUUCEWRRSA-N
Data  1 KI
  Tab Delimited (TSV)   2D SDfile   Computed 3D by Vconf -m prep SDfile
Find this compound or compounds like it in BindingDB:
Activity Spreadsheet -- Enzyme Inhibition Constant Data from BindingDB
Found 1 hit for monomerid = 50213613
TargetCannabinoid receptor 1(Homo sapiens (Human))
The National Hellenic Research Foundation
Curated by ChEMBL
LigandPNGBDBM50213613((6aR,10aR)-3-tert-butyl-6,6,9-trimethyl-6a,7,10,10...)
Affinity DataKi:  14nM. Assay description: Binding affinity to CB1 receptor
In DepthDetails ArticlePubMed