BDBM50213633 2-[(Z)-biphenyl-2-ylimino]-5,5-dimethyl-[1,3]thiazinane-3-carbodithioic acid methyl ester::CHEMBL438507
SMILES CSC(=S)N1CC(C)(C)CS\C1=N/c1ccccc1-c1ccccc1
InChI Key InChIKey=ORRFNRVDGHNYJJ-UZYVYHOESA-N
Data  1 KI
  Tab Delimited (TSV)   2D SDfile   Computed 3D by Vconf -m prep SDfile
Find this compound or compounds like it in BindingDB:
Activity Spreadsheet -- Enzyme Inhibition Constant Data from BindingDB
Found 1 hit for monomerid = 50213633
TargetCannabinoid receptor 2(Homo sapiens (Human))
Shionogi
Curated by ChEMBL
LigandPNGBDBM50213633(2-[(Z)-biphenyl-2-ylimino]-5,5-dimethyl-[1,3]thiaz...)
Affinity DataKi:  989nM. Assay description: Displacement of [3H]CP55940 from human CB2 receptor
In DepthDetails ArticlePubMed